Target
Retinoic acid receptor gamma
Ligand
BDBM50032218
Substrate
Meas. Tech.
ChEMBL_195987 (CHEMBL807693)
EC50
>0.001±n/a nM
Citation
 Beard, RLChandraratna, RAColon, DFGillett, SJHenry, EMarler, DKSong, TDenys, LGarst, MEArefieg, T Synthesis and structure-activity relationships of stilbene retinoid analogs substituted with heteroaromatic carboxylic acids. J Med Chem 38:2820-9 (1995)  
Target
Name:
Retinoic acid receptor gamma
Synonyms:
NR1B3 RAR-gamma RARG_HUMAN Retinoic acid receptor gamma | Retinoid receptor
Type:
PROTEIN
Mol. Mass.:
50345.43
Organism:
Homo sapiens (Human)
Description:
ChEMBL_1458016
Residue:
454
  
Inhibitor
Name:
BDBM50032218
Synonyms:
5-[(E)-2-(3,5,5,8,8-Pentamethyl-5,6,7,8-tetrahydro-naphthalen-2-yl)-propenyl]-furan-2-carboxylic acid | CHEMBL96829
Type:
Small organic molecule
Emp. Form.:
C23H28O3
Mol. Mass.:
352.4666
SMILES:
C\C(=C/c1ccc(o1)C(O)=O)c1cc2c(cc1C)C(C)(C)CCC2(C)C
: