Target
Adenosine kinase
Ligand
BDBM50487833
Substrate
Meas. Tech.
ChEMBL_912301 (CHEMBL3063318)
IC50
9290±n/a nM
Citation
  TBA Med Chem Res 21:590-600 (2012)    Article 
Target
Name:
Adenosine kinase
Synonyms:
ADK_TOXGO | AK
Type:
PROTEIN
Mol. Mass.:
38353.04
Organism:
Toxoplasma gondii
Description:
ChEMBL_629062
Residue:
363
  
Inhibitor
Name:
BDBM50487833
Synonyms:
CHEMBL389929
Type:
Small organic molecule
Emp. Form.:
C17H17Cl2N5O4
Mol. Mass.:
426.254
SMILES:
OC[C@H]1O[C@H]([C@H](O)[C@@H]1O)n1cnc2c(NCc3ccc(Cl)cc3Cl)ncnc12
: