Target
Acetylcholine receptor subunit alpha
Ligand
BDBM50487992
Substrate
Meas. Tech.
ChEMBL_915454 (CHEMBL3076138)
IC50
81000±n/a nM
Citation
 Tomizawa, MLee, DLCasida, JE Neonicotinoid insecticides: molecular features conferring selectivity for insect versus mammalian nicotinic receptors. J Agric Food Chem 48:6016-24 (2000)  
Target
Name:
Acetylcholine receptor subunit alpha
Synonyms:
ACHA_HUMAN Acetylcholine receptor protein alpha chain CHNRA Cholinergic, Nicotinic Alpha1Beta1DeltaGamma Nicotinic acetylcholine receptor alpha-1/beta-1 Nicotinic acetylcholine receptor alpha2/beta4 n-AChR
Type:
Ion channel
Mol. Mass.:
54542.01
Organism:
Homo sapiens (Human)
Description:
Residue:
482
  
Inhibitor
Name:
BDBM50487992
Synonyms:
CHEMBL2270633
Type:
Small organic molecule
Emp. Form.:
C11H13ClN4O2
Mol. Mass.:
268.7
SMILES:
[O-][N+](=O)\C=C1\NCCCN1Cc1ccc(Cl)nc1
: