Target
Deoxyhypusine synthase
Ligand
BDBM50032480
Substrate
Meas. Tech.
ChEMBL_53735 (CHEMBL663660)
IC50
6800±n/a nM
Citation
 Lee, YBPark, MHFolk, JE Diamine and triamine analogs and derivatives as inhibitors of deoxyhypusine synthase: synthesis and biological activity. J Med Chem 38:3053-61 (1995)  
Target
Name:
Deoxyhypusine synthase
Synonyms:
DHYS_RAT | Dhps
Type:
PROTEIN
Mol. Mass.:
40696.63
Organism:
Rattus norvegicus
Description:
ChEMBL_53735
Residue:
369
  
Inhibitor
Name:
BDBM50032480
Synonyms:
CHEMBL101996 | N-(5-Guanidino-pentyl)-guanidine
Type:
Small organic molecule
Emp. Form.:
C7H18N6
Mol. Mass.:
186.258
SMILES:
NC(=N)NCCCCCNC(N)=N
: