Target
Deoxyhypusine synthase
Ligand
BDBM50032486
Substrate
Meas. Tech.
ChEMBL_53735 (CHEMBL663660)
IC50
63000±n/a nM
Citation
 Lee, YBPark, MHFolk, JE Diamine and triamine analogs and derivatives as inhibitors of deoxyhypusine synthase: synthesis and biological activity. J Med Chem 38:3053-61 (1995)  
Target
Name:
Deoxyhypusine synthase
Synonyms:
DHYS_RAT | Dhps
Type:
PROTEIN
Mol. Mass.:
40696.63
Organism:
Rattus norvegicus
Description:
ChEMBL_53735
Residue:
369
  
Inhibitor
Name:
BDBM50032486
Synonyms:
CHEMBL322423 | N*1*-(7-Amino-heptyl)-heptane-1,7-diamine
Type:
Small organic molecule
Emp. Form.:
C14H33N3
Mol. Mass.:
243.4319
SMILES:
NCCCCCCCNCCCCCCCN
: