Target
Deoxyhypusine synthase
Ligand
BDBM50032485
Substrate
Meas. Tech.
ChEMBL_53735 (CHEMBL663660)
IC50
550±n/a nM
Citation
 Lee, YBPark, MHFolk, JE Diamine and triamine analogs and derivatives as inhibitors of deoxyhypusine synthase: synthesis and biological activity. J Med Chem 38:3053-61 (1995)  
Target
Name:
Deoxyhypusine synthase
Synonyms:
DHYS_RAT | Dhps
Type:
PROTEIN
Mol. Mass.:
40696.63
Organism:
Rattus norvegicus
Description:
ChEMBL_53735
Residue:
369
  
Inhibitor
Name:
BDBM50032485
Synonyms:
CHEMBL101419 | N-(8-Amino-octyl)-guanidine
Type:
Small organic molecule
Emp. Form.:
C9H22N4
Mol. Mass.:
186.2978
SMILES:
NCCCCCCCCNC(N)=N
: