Target
Deoxyhypusine synthase
Ligand
BDBM85213
Substrate
Meas. Tech.
ChEMBL_53735 (CHEMBL663660)
IC50
156000±n/a nM
Citation
 Lee, YBPark, MHFolk, JE Diamine and triamine analogs and derivatives as inhibitors of deoxyhypusine synthase: synthesis and biological activity. J Med Chem 38:3053-61 (1995)  
Target
Name:
Deoxyhypusine synthase
Synonyms:
DHYS_RAT | Dhps
Type:
PROTEIN
Mol. Mass.:
40696.63
Organism:
Rattus norvegicus
Description:
ChEMBL_53735
Residue:
369
  
Inhibitor
Name:
BDBM85213
Synonyms:
Agmatine CHEMBL58343 US8633208, Agmatine
Type:
Small organic molecule
Emp. Form.:
C5H14N4
Mol. Mass.:
130.1915
SMILES:
[#7]-[#6]-[#6]-[#6]-[#6]\[#7]=[#6](\[#7])-[#7]
: