Target
Cannabinoid receptor 1
Ligand
BDBM50032555
Substrate
Meas. Tech.
ChEMBL_46624 (CHEMBL658880)
IC50
15±n/a nM
Citation
 Eissenstat, MABell, MRD'Ambra, TEAlexander, EJDaum, SJAckerman, JHGruett, MDKumar, VEstep, KGOlefirowicz, EM Aminoalkylindoles: structure-activity relationships of novel cannabinoid mimetics. J Med Chem 38:3094-105 (1995)  
Target
Name:
Cannabinoid receptor 1
Synonyms:
Brain-type cannabinoid receptor CB-R CNR1_RAT Cannabinoid receptor Cnr1 | Skr6
Type:
G Protein-Coupled Receptor (GPCR)
Mol. Mass.:
52856.55
Organism:
Rattus norvegicus (rat)
Description:
P20272
Residue:
473
  
Inhibitor
Name:
BDBM50032555
Synonyms:
4-[2-Methyl-1-(2-morpholin-4-yl-ethyl)-1H-indole-3-carbonyl]-naphthalene-1-carbonitrile | CHEMBL81683
Type:
Small organic molecule
Emp. Form.:
C27H25N3O2
Mol. Mass.:
423.5063
SMILES:
Cc1c(C(=O)c2ccc(C#N)c3ccccc23)c2ccccc2n1CCN1CCOCC1
: