Target
Cannabinoid receptor 1
Ligand
BDBM50032556
Substrate
Meas. Tech.
ChEMBL_46624 (CHEMBL658880)
IC50
138±n/a nM
Citation
 Eissenstat, MABell, MRD'Ambra, TEAlexander, EJDaum, SJAckerman, JHGruett, MDKumar, VEstep, KGOlefirowicz, EM Aminoalkylindoles: structure-activity relationships of novel cannabinoid mimetics. J Med Chem 38:3094-105 (1995)  
Target
Name:
Cannabinoid receptor 1
Synonyms:
Brain-type cannabinoid receptor CB-R CNR1_RAT Cannabinoid receptor Cnr1 | Skr6
Type:
G Protein-Coupled Receptor (GPCR)
Mol. Mass.:
52856.55
Organism:
Rattus norvegicus (rat)
Description:
P20272
Residue:
473
  
Inhibitor
Name:
BDBM50032556
Synonyms:
Benzofuran-5-yl-[1-(2-morpholin-4-yl-ethyl)-1H-indol-3-yl]-methanone | CHEMBL311667
Type:
Small organic molecule
Emp. Form.:
C23H22N2O3
Mol. Mass.:
374.4324
SMILES:
O=C(c1cn(CCN2CCOCC2)c2ccccc12)c1ccc2occc2c1
: