Target
Retinoic acid receptor RXR-gamma
Ligand
BDBM50032669
Substrate
Meas. Tech.
ChEMBL_197220 (CHEMBL798968)
EC50
>10000±n/a nM
Citation
 Boehm, MFZhang, LZhi, LMcClurg, MRBerger, EWagoner, MMais, DESuto, CMDavies, JAHeyman, RA Design and synthesis of potent retinoid X receptor selective ligands that induce apoptosis in leukemia cells. J Med Chem 38:3146-55 (1995)  
Target
Name:
Retinoic acid receptor RXR-gamma
Synonyms:
Nr2b3 Retinoid X receptor gamma | Rxrg
Type:
PROTEIN
Mol. Mass.:
50900.28
Organism:
Mus musculus
Description:
ChEMBL_196589
Residue:
463
  
Inhibitor
Name:
BDBM50032669
Synonyms:
3-(3,5,5,8,8-Pentamethyl-5,6,7,8-tetrahydro-naphthalene-2-carbonyl)-benzoic acid CHEMBL108162
Type:
Small organic molecule
Emp. Form.:
C23H26O3
Mol. Mass.:
350.4507
SMILES:
Cc1cc2c(cc1C(=O)c1cccc(c1)C(O)=O)C(C)(C)CCC2(C)C
: