Target
3-oxo-5-alpha-steroid 4-dehydrogenase 2
Ligand
BDBM50488097
Substrate
Meas. Tech.
ChEMBL_922089 (CHEMBL3078155)
IC50
0.100000±n/a nM
Citation
  TBA Med Chem Res 22:105-114 (2013)    Article 
Target
Name:
3-oxo-5-alpha-steroid 4-dehydrogenase 2
Synonyms:
3-oxo-5-alpha-steroid 4-dehydrogenase 2 5α-Reductase 2 (5α-R2) SR type 2 Steroid 5-alpha-reductase Type II 5-alpha reductase
Type:
Enzyme
Mol. Mass.:
28406.59
Organism:
Homo sapiens (Human)
Description:
P31213
Residue:
254
  
Inhibitor
Name:
BDBM50488097
Synonyms:
CHEMBL2282649
Type:
Small organic molecule
Emp. Form.:
C24H37NO2
Mol. Mass.:
371.5561
SMILES:
CC(C)CC(=O)[C@H]1CC[C@H]2[C@@H]3CN(C)C4=CC(=O)CC[C@]4(C)[C@H]3CC[C@]12C
: