Target
Gamma-aminobutyric acid type B receptor subunit 1
Ligand
BDBM50032984
Substrate
Meas. Tech.
ChEMBL_68561 (CHEMBL679648)
IC50
6000±n/a nM
Citation
 Froestl, WMickel, SJvon Sprecher, GDiel, PJHall, RGMaier, LStrub, DMelillo, VBaumann, PABernasconi, R Phosphinic acid analogues of GABA. 2. Selective, orally active GABAB antagonists. J Med Chem 38:3313-31 (1995)  
Target
Name:
Gamma-aminobutyric acid type B receptor subunit 1
Synonyms:
GABA B GABA uptake GABA-B-R1 GABABR1 Gabbr1 | Gb1
Type:
Enzyme Catalytic Domain
Mol. Mass.:
111548.69
Organism:
Rattus norvegicus (Rat)
Description:
Q9Z0U4
Residue:
991
  
Inhibitor
Name:
BDBM50032984
Synonyms:
CHEMBL113305 | [3-Amino-2-(4-chloro-phenyl)-2-hydroxy-propyl]-methyl-phosphinic acid
Type:
Small organic molecule
Emp. Form.:
C10H15ClNO3P
Mol. Mass.:
263.658
SMILES:
CP(O)(=O)CC(O)(CN)c1ccc(Cl)cc1
: