Target
Gamma-aminobutyric acid type B receptor subunit 1
Ligand
BDBM50033029
Substrate
Meas. Tech.
ChEMBL_68561 (CHEMBL679648)
IC50
10000±n/a nM
Citation
 Froestl, WMickel, SJvon Sprecher, GDiel, PJHall, RGMaier, LStrub, DMelillo, VBaumann, PABernasconi, R Phosphinic acid analogues of GABA. 2. Selective, orally active GABAB antagonists. J Med Chem 38:3313-31 (1995)  
Target
Name:
Gamma-aminobutyric acid type B receptor subunit 1
Synonyms:
GABA B GABA uptake GABA-B-R1 GABABR1 Gabbr1 | Gb1
Type:
Enzyme Catalytic Domain
Mol. Mass.:
111548.69
Organism:
Rattus norvegicus (Rat)
Description:
Q9Z0U4
Residue:
991
  
Inhibitor
Name:
BDBM50033029
Synonyms:
(3-Amino-propyl)-phenethyl-phosphinic acid | CHEMBL324407
Type:
Small organic molecule
Emp. Form.:
C11H18NO2P
Mol. Mass.:
227.2399
SMILES:
NCCCP(O)(=O)CCc1ccccc1
: