Target
Interleukin-2
Ligand
BDBM50033058
Substrate
Meas. Tech.
ChEMBL_89079 (CHEMBL698590)
IC50
70±n/a nM
Citation
 Mikol, VPapageorgiou, CBorer, X The role of water molecules in the structure-based design of (5-hydroxynorvaline)-2-cyclosporin: synthesis, biological activity, and crystallographic analysis with cyclophilin A. J Med Chem 38:3361-7 (1995)  
Target
Name:
Interleukin-2
Synonyms:
IL2_MOUSE Il2 TCGF
Type:
PROTEIN
Mol. Mass.:
19394.78
Organism:
Mus musculus
Description:
ChEMBL_89079
Residue:
169
  
Inhibitor
Name:
BDBM50033058
Synonyms:
33-(1-Hydroxy-2-methyl-hex-4-enyl)-30-(3-hydroxy-propyl)-6,9,18,24-tetraisobutyl-3,21-diisopropyl-1,4,7,10,12,15,19,25,28-nonamethyl-1,4,7,10,13,16,19,22,25,28,31undecaaza-cyclotritriacontan-2,5,8,11,14,17,20,23,26,29,32-undecaone | CHEMBL415597
Type:
Small organic molecule
Emp. Form.:
C63H113N11O13
Mol. Mass.:
1232.6372
SMILES:
C\C=C\C[C@@H](C)[C@@H](O)[C@H]1N(C)C(=O)[C@@H](C(C)C)N(C)C(=O)[C@@H](CC(C)C)N(C)C(=O)[C@@H](CC(C)C)N(C)C(=O)[C@H](C)NC(=O)[C@@H](C)NC(=O)[C@@H](CC(C)C)N(C)C(=O)[C@H](NC(=O)[C@@H](CC(C)C)N(C)C(=O)CN(C)C(=O)[C@@H](CCCO)NC1=O)C(C)C
: