Target
Alpha-1D adrenergic receptor
Ligand
BDBM50033109
Substrate
Meas. Tech.
ChEMBL_32732 (CHEMBL646003)
Ki
0.03±n/a nM
Citation
 Hieble, JPBondinell, WERuffolo, RR Alpha- and beta-adrenoceptors: from the gene to the clinic. 1. Molecular biology and adrenoceptor subclassification. J Med Chem 38:3415-44 (1995)  
Target
Name:
Alpha-1D adrenergic receptor
Synonyms:
ADA1D_RAT Adra1d Alpha-1D adrenergic receptor | Serotonin 1a (5-HT1a) receptor/Adrenergic receptor alpha-1
Type:
Protein
Mol. Mass.:
59375.97
Organism:
Rattus norvegicus (Rat)
Description:
P23944
Residue:
561
  
Inhibitor
Name:
BDBM50033109
Synonyms:
2-(6,7-Dimethoxy-3,4-dihydro-1H-isoquinolin-2-yl)-6,7-dimethoxy-quinolin-4-ylamine CHEMBL324090
Type:
Small organic molecule
Emp. Form.:
C22H25N3O4
Mol. Mass.:
395.4516
SMILES:
COc1cc2CCN(Cc2cc1OC)c1cc(N)c2cc(OC)c(OC)cc2n1
: