Target
Reverse transcriptase/RNaseH
Ligand
BDBM1368
Substrate
Meas. Tech.
ChEMBL_196795 (CHEMBL802186)
IC50
30±n/a nM
Citation
 Schäfer, WFriebe, WGLeinert, HMertens, APoll, Tvon der Saal, WZilch, HNuber, BZiegler, ML Non-nucleoside inhibitors of HIV-1 reverse transcriptase: molecular modeling and X-ray structure investigations. J Med Chem 36:726-32 (1993)  
Target
Name:
Reverse transcriptase/RNaseH
Synonyms:
HIV-1 Reverse Transcriptase RNase H Reverse transcriptase/RNaseH
Type:
PROTEIN
Mol. Mass.:
65229.15
Organism:
Human immunodeficiency virus 1
Description:
ChEMBL_1473730
Residue:
566
  
Inhibitor
Name:
BDBM1368
Synonyms:
9b-(3-methylphenyl)-2H,3H,5H,9bH-isoindolo[1,2-b][1,3]thiazol-5-one Thiazoloisoindol-5-one deriv. 13
Type:
Small organic molecule
Emp. Form.:
C17H15NOS
Mol. Mass.:
281.372
SMILES:
Cc1cccc(c1)C12SCCN1C(=O)c1ccccc21
: