Target
1-deoxy-D-xylulose 5-phosphate reductoisomerase, chloroplastic
Ligand
BDBM50153713
Substrate
Meas. Tech.
ChEMBL_925784 (CHEMBL3069077)
IC50
100±n/a nM
Citation
 Witschel, MRöhl, FNiggeweg, RNewton, T In search of new herbicidal inhibitors of the non-mevalonate pathway. Pest Manag Sci 69:559-63 (2013)  
Target
Name:
1-deoxy-D-xylulose 5-phosphate reductoisomerase, chloroplastic
Synonyms:
1-deoxy-D-xylulose 5-phosphate reductoisomerase, chloroplastic 1.1.1.267 DXP reductoisomerase DXR_ARATH PDE129 Protein PIGMENT-DEFECTIVE EMBRYO 129
Type:
PROTEIN
Mol. Mass.:
51966.29
Organism:
Arabidopsis thaliana
Description:
ChEMBL_105556
Residue:
477
  
Inhibitor
Name:
BDBM50153713
Synonyms:
3-(N-hydroxyformamido)propylphosphonic acid CHEMBL203125 fosmidomycin
Type:
Small organic molecule
Emp. Form.:
C4H10NO5P
Mol. Mass.:
183.0997
SMILES:
ON(CCCP(O)(O)=O)C=O
: