Target
DNA topoisomerase 1
Ligand
BDBM50033714
Substrate
Meas. Tech.
ChEMBL_54018 (CHEMBL663903)
IC50
207000±n/a nM
Citation
 Ahn, BZBaik, KUKweon, GRLim, KHwang, BD Acylshikonin analogues: synthesis and inhibition of DNA topoisomerase-I. J Med Chem 38:1044-7 (1995)  
Target
Name:
DNA topoisomerase 1
Synonyms:
DNA topoisomerase I TOP1 | TOP1_HUMAN
Type:
Enzyme
Mol. Mass.:
90771.02
Organism:
Homo sapiens (Human)
Description:
P11387
Residue:
765
  
Inhibitor
Name:
BDBM50033714
Synonyms:
CHEMBL265619 | Hexanoic acid (R)-1-(5,8-dihydroxy-1,4-dioxo-1,4-dihydro-naphthalen-2-yl)-4-methyl-pent-3-enyl ester
Type:
Small organic molecule
Emp. Form.:
C22H26O6
Mol. Mass.:
386.4382
SMILES:
[#6]-[#6]-[#6]-[#6]-[#6]-[#6](=O)-[#8]-[#6](=[#6]\[#6]=[#6](\[#6])-[#6])-c1cc(-[#8])c2c(-[#8])ccc(-[#8])c2c1-[#8]
: