Target
Acetylcholinesterase
Ligand
BDBM50248712
Substrate
Meas. Tech.
ChEMBL_931328 (CHEMBL3069985)
IC50
266±n/a nM
Citation
  TBA Med Chem Res 22:2328-2345 (2013)    Article 
Target
Name:
Acetylcholinesterase
Synonyms:
ACES_RAT Acetylcholinesterase and butyrylcholinesterase (AChE and BChE) Acetylcholinesterase, AChE | Ache
Type:
Enzyme
Mol. Mass.:
68193.62
Organism:
Rattus norvegicus (rat)
Description:
P37136
Residue:
614
  
Inhibitor
Name:
BDBM50248712
Synonyms:
(E)-2-{4-[(Ethylmethylamino)methyl]benzylidene}-5,6-dimethoxy-2,3-dihydroinden-1-one | CHEMBL464024
Type:
Small organic molecule
Emp. Form.:
C22H25NO3
Mol. Mass.:
351.4388
SMILES:
CCN(C)Cc1ccc(\C=C2/Cc3cc(OC)c(OC)cc3C2=O)cc1
: