Target
DNA topoisomerase 1
Ligand
BDBM50033772
Substrate
Meas. Tech.
ChEMBL_53720 (CHEMBL663648)
IC50
700±n/a nM
Citation
 Lackey, KBesterman, JMFletcher, WLeitner, PMorton, BSternbach, DD Rigid analogs of camptothecin as DNA topoisomerase I inhibitors. J Med Chem 38:906-11 (1995)  
Target
Name:
DNA topoisomerase 1
Synonyms:
DNA topoisomerase I TOP1 | TOP1_HUMAN
Type:
Enzyme
Mol. Mass.:
90771.02
Organism:
Homo sapiens (Human)
Description:
P11387
Residue:
765
  
Inhibitor
Name:
BDBM50033772
Synonyms:
CHEMBL354432 | ethyl 8-ethyl-8-hydroxy-9,12-dioxo-2,3,8,9,12,14-hexahydro-11H-[1,4]dioxino[2,3-g]pyrano[3',4':6,7]indolizino[1,2-b]quinoline-15-carboxylate
Type:
Small organic molecule
Emp. Form.:
C25H22N2O8
Mol. Mass.:
478.4508
SMILES:
CCOC(=O)c1c2Cn3c(cc4c(COC(=O)C4(O)CC)c3=O)-c2nc2cc3OCCOc3cc12
: