Target
DNA topoisomerase 1
Ligand
BDBM50033783
Substrate
Meas. Tech.
ChEMBL_53720 (CHEMBL663648)
IC50
1500±n/a nM
Citation
 Lackey, KBesterman, JMFletcher, WLeitner, PMorton, BSternbach, DD Rigid analogs of camptothecin as DNA topoisomerase I inhibitors. J Med Chem 38:906-11 (1995)  
Target
Name:
DNA topoisomerase 1
Synonyms:
DNA topoisomerase I TOP1 | TOP1_HUMAN
Type:
Enzyme
Mol. Mass.:
90771.02
Organism:
Homo sapiens (Human)
Description:
P11387
Residue:
765
  
Inhibitor
Name:
BDBM50033783
Synonyms:
4-Ethyl-8,9-difluoro-4-hydroxy-3,13-dioxo-3,4,12,13-tetrahydro-1H-2-oxa-6,12a-diaza-dibenzo[b,h]fluorene-11-carboxylic acid | CHEMBL174233
Type:
Small organic molecule
Emp. Form.:
C21H14F2N2O6
Mol. Mass.:
428.3425
SMILES:
CCC1(O)C(=O)OCc2c1cc1-c3nc4cc(F)c(F)cc4c(C(O)=O)c3Cn1c2=O
: