Target
DNA topoisomerase 1
Ligand
BDBM50033791
Substrate
Meas. Tech.
ChEMBL_53723 (CHEMBL663651)
IC50
32000±n/a nM
Citation
 Lackey, KBesterman, JMFletcher, WLeitner, PMorton, BSternbach, DD Rigid analogs of camptothecin as DNA topoisomerase I inhibitors. J Med Chem 38:906-11 (1995)  
Target
Name:
DNA topoisomerase 1
Synonyms:
DNA topoisomerase I TOP1 | TOP1_HUMAN
Type:
Enzyme
Mol. Mass.:
90771.02
Organism:
Homo sapiens (Human)
Description:
P11387
Residue:
765
  
Inhibitor
Name:
BDBM50033791
Synonyms:
4-Ethyl-4-hydroxy-7-[5-iodo-2-oxo-1,2-dihydro-indol-(3E)-ylidene]-1,4,7,8-tetrahydro-pyrano[3,4-f]indolizine-3,6,10-trione | CHEMBL171761
Type:
Small organic molecule
Emp. Form.:
C21H15IN2O6
Mol. Mass.:
518.2581
SMILES:
CCC1(O)C(=O)OCc2c1cc1C(=O)\C(Cn1c2=O)=C1\C(=O)Nc2ccc(I)cc12
: