Target
D(2) dopamine receptor
Ligand
BDBM50033843
Substrate
Meas. Tech.
ChEMBL_61444 (CHEMBL670670)
IC50
150±n/a nM
Citation
 Perrone, RBerardi, FColabufo, NALeopoldo, MTortorella, VFiorentini, FOlgiati, VGhiglieri, AGovoni, S High affinity and selectivity on 5-HT1A receptor of 1-aryl-4-[1-tetralin)alkyl]piperazines. 2. J Med Chem 38:942-9 (1995)  
Target
Name:
D(2) dopamine receptor
Synonyms:
DOPAMINE D2 DOPAMINE D2 Short Dopamine D2 receptor Drd2
Type:
G Protein-Coupled Receptor (GPCR)
Mol. Mass.:
50931.60
Organism:
Rattus norvegicus (rat)
Description:
P61169
Residue:
444
  
Inhibitor
Name:
BDBM50033843
Synonyms:
1-[3-(5-Methoxy-3,4-dihydro-2H-naphthalen-1-ylidene)-propyl]-4-pyridin-2-yl-piperazine CHEMBL140406
Type:
Small organic molecule
Emp. Form.:
C23H29N3O
Mol. Mass.:
363.4959
SMILES:
COc1cccc2\C(CCCc12)=C\CCN1CCN(CC1)c1ccccn1
: