Target
Sigma non-opioid intracellular receptor 1
Ligand
BDBM50033853
Substrate
Meas. Tech.
ChEMBL_201264 (CHEMBL804882)
IC50
52±n/a nM
Citation
 Perrone, RBerardi, FColabufo, NALeopoldo, MTortorella, VFiorentini, FOlgiati, VGhiglieri, AGovoni, S High affinity and selectivity on 5-HT1A receptor of 1-aryl-4-[1-tetralin)alkyl]piperazines. 2. J Med Chem 38:942-9 (1995)  
Target
Name:
Sigma non-opioid intracellular receptor 1
Synonyms:
Aging-associated gene 8 protein SGMR1_HUMAN SIGMAR1 SR31747-binding protein Sigma 1-type opioid receptor Sigma1R | hSigmaR1
Type:
Enzyme Catalytic Domain
Mol. Mass.:
25124.85
Organism:
Homo sapiens (Human)
Description:
Q99720
Residue:
223
  
Inhibitor
Name:
BDBM50033853
Synonyms:
1-[3-(5-Methoxy-3,4-dihydro-naphthalen-1-yl)-propyl]-4-pyridin-2-yl-piperazine | CHEMBL175300
Type:
Small organic molecule
Emp. Form.:
C23H29N3O
Mol. Mass.:
363.4959
SMILES:
COc1cccc2C(CCCN3CCN(CC3)c3ccccn3)=CCCc12
: