Target
Integrin alpha-L/beta-2
Ligand
BDBM50033942
Substrate
Meas. Tech.
ChEMBL_96790 (CHEMBL703267)
IC50
3000±n/a nM
Citation
 Sanfilippo, PJJetter, MCCordova, RNoe, RAChourmouzis, ELau, CYWang, E Novel thiazole based heterocycles as inhibitors of LFA-1/ICAM-1 mediated cell adhesion. J Med Chem 38:1057-9 (1995)  
Target
Name:
Integrin alpha-L/beta-2
Synonyms:
Integrin alpha-L/beta-2 (LFA-1) | Integrin beta-2/Leukocyte adhesion glycoprotein LFA-1 alpha
Type:
Mol. Mass.:
Description:
ASSAY_ID of EBI is 32646
Components:
This complex has 2 components.
Component 1
Name:
Integrin alpha-L
Synonyms:
CD11 antigen-like family member A CD_antigen=CD11a ITGAL LFA-1A Leukocyte adhesion glycoprotein LFA-1 alpha chain | Leukocyte function-associated molecule 1 alpha chain
Type:
PROTEIN
Mol. Mass.:
128748.90
Organism:
Homo sapiens (Human)
Description:
ChEMBL_629045
Residue:
1170
  
Component 2
Name:
Integrin beta-2
Synonyms:
CD18 ITGB2 MFI7
Type:
PROTEIN
Mol. Mass.:
84785.60
Organism:
Homo sapiens (Human)
Description:
EBI_12662
Residue:
769
  
Inhibitor
Name:
BDBM50033942
Synonyms:
5-Ethyl-1-[4-(3-trifluoromethyl-phenyl)-thiazol-2-yl]-1H-pyrazole-4-carboxylic acid (3-hydroxy-propyl)-amide | CHEMBL10101
Type:
Small organic molecule
Emp. Form.:
C19H19F3N4O2S
Mol. Mass.:
424.44
SMILES:
CCc1c(cnn1-c1nc(cs1)-c1cccc(c1)C(F)(F)F)C(=O)NCCCO
: