Target
Mu-type opioid receptor
Ligand
BDBM50034244
Substrate
Meas. Tech.
ChEMBL_145151 (CHEMBL755955)
Ki
>10000±n/a nM
Citation
 Heyl, DLDandabathula, MKurtz, KRMousigian, C Opioid receptor binding requirements for the delta-selective peptide deltorphin. I: Phe3 replacement with ring-substituted and heterocyclic amino acids. J Med Chem 38:1242-6 (1995)  
Target
Name:
Mu-type opioid receptor
Synonyms:
M-OR-1 Mu opioid receptor OPIATE Mu OPRM_CAVPO
Type:
Enzyme Catalytic Domain
Mol. Mass.:
11165.58
Organism:
GUINEA PIG
Description:
P97266
Residue:
98
  
Inhibitor
Name:
BDBM50034244
Synonyms:
(S)-3-((S)-2-{(S)-2-[(S)-2-Amino-3-(4-hydroxy-phenyl)-propionylamino]-propionylamino}-3-pentafluorophenyl-propionylamino)-N-{(S)-1-[(S)-1-(carbamoylmethyl-carbamoyl)-2-methyl-propylcarbamoyl]-2-methyl-propyl}-succinamic acid | CHEMBL21893
Type:
Small organic molecule
Emp. Form.:
C37H47F5N8O10
Mol. Mass.:
858.8087
SMILES:
CC(C)[C@H](NC(=O)[C@@H](NC(=O)[C@H](CC(O)=O)NC(=O)[C@H](Cc1c(F)c(F)c(F)c(F)c1F)NC(=O)[C@H](C)NC(=O)[C@@H](N)Cc1ccc(O)cc1)C(C)C)C(=O)NCC(N)=O
: