Target
5-hydroxytryptamine receptor 1A
Ligand
BDBM50034335
Substrate
Meas. Tech.
ChEMBL_589 (CHEMBL615459)
Ki
11±n/a nM
Citation
 Jain, ANHarris, NLPark, JY Quantitative binding site model generation: compass applied to multiple chemotypes targeting the 5-HT1A receptor. J Med Chem 38:1295-308 (1995)  
Target
Name:
5-hydroxytryptamine receptor 1A
Synonyms:
5-HT-1A 5-hydroxytryptamine receptor 1A (5-HT-1A) ADRB2RL1 Dopamine D2 receptor and serotonin 1a receptor HTR1A | Serotonin receptor 1A
Type:
Mol. Mass.:
46122.49
Organism:
Homo sapiens (Human)
Description:
Residue:
422
  
Inhibitor
Name:
BDBM50034335
Synonyms:
(3aR,9bR)-3-Allyl-2,3,3a,4,5,9b-hexahydro-1H-benzo[e]indole | CHEMBL286006
Type:
Small organic molecule
Emp. Form.:
C15H19N
Mol. Mass.:
213.3181
SMILES:
C=CCN1CC[C@H]2[C@H]1CCc1ccccc21
: