Target
Dipeptidyl peptidase 4
Ligand
BDBM11593
Substrate
Meas. Tech.
ChEMBL_929372 (CHEMBL3074800)
IC50
0.100000±n/a nM
Citation
  TBA Med Chem Res 22:4505-4521 (2013)    Article 
Target
Name:
Dipeptidyl peptidase 4
Synonyms:
ADABP Adenosine deaminase complexing protein 2 CD_antigen=CD26 DPP4 DPPIV Dipeptidyl peptidase 4 (DPP IV) Dipeptidyl peptidase 4 (DPP4) Dipeptidyl peptidase 4 membrane form Dipeptidyl peptidase IV Dipeptidyl peptidase IV (DDP-IV) Dipeptidyl peptidase IV membrane form Dipeptidyl peptidase-IV (DPP-4) T-cell activation antigen CD26 | TP103
Type:
Enzyme
Mol. Mass.:
88271.01
Organism:
Homo sapiens (Human)
Description:
P27487
Residue:
766
  
Inhibitor
Name:
BDBM11593
Synonyms:
5-(aminomethyl)-6-(2,4-dichlorophenyl)-2-(3,5-dimethoxyphenyl)pyrimidin-4-amine | Aminomethylpyrimidine 1e
Type:
Small organic molecule
Emp. Form.:
C19H18Cl2N4O2
Mol. Mass.:
405.278
SMILES:
COc1cc(OC)cc(c1)-c1nc(N)c(CN)c(n1)-c1ccc(Cl)cc1Cl
: