Target
Histamine H3 receptor
Ligand
BDBM50034711
Substrate
Meas. Tech.
ChEMBL_85848 (CHEMBL693575)
Ki
0.8±n/a nM
Citation
 Shih, NYLupo, ATAslanian, ROrlando, SPiwinski, JJGreen, MJGanguly, AKClark, MATozzi, SKreutner, W A novel pyrrolidine analog of histamine as a potent, highly selective histamine H3 receptor agonist. J Med Chem 38:1593-9 (1995)  
Target
Name:
Histamine H3 receptor
Synonyms:
HISTAMINE H3 HRH3_CAVPO | Histamine H3 receptor
Type:
Enzyme Catalytic Domain
Mol. Mass.:
48753.61
Organism:
GUINEA PIG
Description:
HISTAMINE H3 HRH3 GUINEA PIG::Q9JI35
Residue:
445
  
Inhibitor
Name:
BDBM50034711
Synonyms:
(1R,2S)-2-(1H-Imidazol-4-yl)-1-methyl-propylamine | CHEMBL277341
Type:
Small organic molecule
Emp. Form.:
C7H13N3
Mol. Mass.:
139.1982
SMILES:
C[C@@H](N)[C@H](C)c1cnc[nH]1
: