Target
Neprilysin
Ligand
BDBM50034841
Substrate
Meas. Tech.
ChEMBL_144616 (CHEMBL750544)
IC50
0.700000±n/a nM
Citation
 Ksander, GMGhai, RDdeJesus, RDiefenbacher, CGYuan, ABerry, CSakane, YTrapani, A Dicarboxylic acid dipeptide neutral endopeptidase inhibitors. J Med Chem 38:1689-700 (1995)  
Target
Name:
Neprilysin
Synonyms:
Mme Neprilysin Neutral endopeptidase 24.11
Type:
Protein
Mol. Mass.:
85789.59
Organism:
Rattus norvegicus (Rat)
Description:
P07861
Residue:
750
  
Inhibitor
Name:
BDBM50034841
Synonyms:
(S)-5-Biphenyl-4-yl-4-(2-carboxy-ethylcarbamoyl)-pentanoic acid | CHEMBL45123
Type:
Small organic molecule
Emp. Form.:
C21H23NO5
Mol. Mass.:
369.411
SMILES:
OC(=O)CCNC(=O)[C@@H](CCC(O)=O)Cc1ccc(cc1)-c1ccccc1
: