Target
Thymidylate synthase
Ligand
BDBM50035009
Substrate
Meas. Tech.
ChEMBL_209776 (CHEMBL815566)
Ki
18±n/a nM
Citation
 Varney, MDPalmer, CLDeal, JGWebber, SWelsh, KMBartlett, CAMorse, CASmith, WWJanson, CA Synthesis and biological evaluation of novel 2,6-diaminobenz[cd]indole inhibitors of thymidylate synthase using the protein structure as a guide. J Med Chem 38:1892-903 (1995)  
Target
Name:
Thymidylate synthase
Synonyms:
TS TYMS Thymidylate synthase (TS) | Thymidylate synthase/GAR transformylase/AICAR transformylase
Type:
Enzyme
Mol. Mass.:
35718.07
Organism:
Homo sapiens (Human)
Description:
Residue:
313
  
Inhibitor
Name:
BDBM50035009
Synonyms:
(4-{[(2-Amino-benzo[cd]indol-6-yl)-methyl-amino]-methyl}-pyridin-2-yl)-methanol | CHEMBL294871
Type:
Small organic molecule
Emp. Form.:
C19H18N4O
Mol. Mass.:
318.3724
SMILES:
CN(Cc1ccnc(CO)c1)c1ccc2N=C(N)c3cccc1c23
: