Target
5-hydroxytryptamine receptor 1A
Ligand
BDBM50035057
Substrate
Meas. Tech.
ChEMBL_1192 (CHEMBL615958)
Ki
40±n/a nM
Citation
 Kuipers, Wvan Wijngaarden, IKruse, CGter Horst-van Amstel, MTulp, MTIJzerman, AP N4-unsubstituted N1-arylpiperazines as high-affinity 5-HT1A receptor ligands. J Med Chem 38:1942-54 (1995)  
Target
Name:
5-hydroxytryptamine receptor 1A
Synonyms:
5-HT-1A 5-HT1A 5-hydroxytryptamine receptor 1A (5HT1A) 5ht1a Htr1a Serotonin 1a (5-HT1a) receptor/Adrenergic receptor alpha-1 | Serotonin receptor 1A
Type:
G Protein-Coupled Receptor (GPCR)
Mol. Mass.:
46445.29
Organism:
Rattus norvegicus (rat)
Description:
Binding assays were performed using rat hippocampal membranes.
Residue:
422
  
Inhibitor
Name:
BDBM50035057
Synonyms:
(eltoprazine)1-(2,3-Dihydro-benzo[1,4]dioxin-5-yl)-piperazine CHEMBL282614 | Eltoprazine
Type:
Small organic molecule
Emp. Form.:
C12H16N2O2
Mol. Mass.:
220.2676
SMILES:
C1CN(CCN1)c1cccc2OCCOc12
: