Target
Muscarinic acetylcholine receptor M3
Ligand
BDBM50491122
Substrate
Meas. Tech.
ChEMBL_956583 (CHEMBL2380033)
Ki
243±n/a nM
Citation
 Bhattacharjee, AKPomponio, JWEvans, SAPervitsky, DGordon, RK Discovery of subtype selective muscarinic receptor antagonists as alternatives to atropine using in silico pharmacophore modeling and virtual screening methods. Bioorg Med Chem 21:2651-62 (2013)  
Target
Name:
Muscarinic acetylcholine receptor M3
Synonyms:
ACM3_HUMAN Cholinergic, muscarinic M3 Muscarinic receptor M3 | RecName: Full=Muscarinic acetylcholine receptor M3
Type:
Enzyme
Mol. Mass.:
66151.03
Organism:
Homo sapiens (Human)
Description:
P20309
Residue:
590
  
Inhibitor
Name:
BDBM50491122
Synonyms:
CHEMBL1191560
Type:
Small organic molecule
Emp. Form.:
C22H29NO2
Mol. Mass.:
339.4712
SMILES:
CCN(CC)CCOC(=O)C(CC)(c1ccccc1)c1ccccc1
: