Target
Muscarinic acetylcholine receptor M2
Ligand
BDBM50005685
Substrate
Meas. Tech.
ChEMBL_956584 (CHEMBL2380034)
Ki
107±n/a nM
Citation
 Bhattacharjee, AKPomponio, JWEvans, SAPervitsky, DGordon, RK Discovery of subtype selective muscarinic receptor antagonists as alternatives to atropine using in silico pharmacophore modeling and virtual screening methods. Bioorg Med Chem 21:2651-62 (2013)  
Target
Name:
Muscarinic acetylcholine receptor M2
Synonyms:
ACM2_HUMAN Cholinergic, muscarinic M2 Muscarinic acetylcholine receptor M2 and M5 | RecName: Full=Muscarinic acetylcholine receptor M2
Type:
GPCR
Mol. Mass.:
51730.61
Organism:
Homo sapiens (Human)
Description:
P08172
Residue:
466
  
Inhibitor
Name:
BDBM50005685
Synonyms:
2,2-Diphenyl-propionic acid 2-diethylamino-ethyl ester 2-(diethylamino)ethyl 2,2-diphenylpropanoate Aprophen | CHEMBL26505
Type:
Small organic molecule
Emp. Form.:
C21H27NO2
Mol. Mass.:
325.4446
SMILES:
CCN(CC)CCOC(=O)C(C)(c1ccccc1)c1ccccc1
: