Target
Muscarinic acetylcholine receptor M1
Ligand
BDBM50491131
Substrate
Meas. Tech.
ChEMBL_956585 (CHEMBL2380035)
Ki
271±n/a nM
Citation
 Bhattacharjee, AKPomponio, JWEvans, SAPervitsky, DGordon, RK Discovery of subtype selective muscarinic receptor antagonists as alternatives to atropine using in silico pharmacophore modeling and virtual screening methods. Bioorg Med Chem 21:2651-62 (2013)  
Target
Name:
Muscarinic acetylcholine receptor M1
Synonyms:
ACM1_HUMAN Cholinergic receptor, muscarinic 1 | Cholinergic, muscarinic M1
Type:
Protein
Mol. Mass.:
51442.54
Organism:
Homo sapiens (Human)
Description:
P11229
Residue:
460
  
Inhibitor
Name:
BDBM50491131
Synonyms:
Bietamiverine
Type:
Small organic molecule
Emp. Form.:
C19H30N2O2
Mol. Mass.:
318.4537
SMILES:
CCN(CC)CCOC(=O)C(N1CCCCC1)c1ccccc1
: