Target
Protein kinase C delta type
Ligand
BDBM50491402
Substrate
Meas. Tech.
ChEMBL_959553 (CHEMBL2384827)
Ki
4.1±n/a nM
Citation
 Kamachi, HTanaka, KYanagita, RCMurakami, AMurakami, KTokuda, HSuzuki, NNakagawa, YIrie, K Structure-activity studies on the side chain of a simplified analog of aplysiatoxin (aplog-1) with anti-proliferative activity. Bioorg Med Chem 21:2695-702 (2013)  
Target
Name:
Protein kinase C delta type
Synonyms:
KPCD_HUMAN PKCD Protein Kinase C- delta nPKC-delta
Type:
Enzyme
Mol. Mass.:
77516.79
Organism:
Homo sapiens (Human)
Description:
The recombinant human PKC enzymes were produced using a baculovirus expression system in SF9 cells
Residue:
676
  
Inhibitor
Name:
BDBM50491402
Synonyms:
CHEMBL2381163
Type:
Small organic molecule
Emp. Form.:
C27H36Br2O8
Mol. Mass.:
648.378
SMILES:
[H][C@@]12CCC(C)(C)[C@]3(C[C@@]([H])(C[C@@H](CCCCc4cc(O)c(Br)cc4Br)O3)OC(=O)C[C@H](CO)OC(=O)C1)O2
: