Target
Thymidine kinase, cytosolic
Ligand
BDBM21866
Substrate
Meas. Tech.
ChEMBL_208011 (CHEMBL816091)
Ki
50±n/a nM
Citation
 Xu, HMaga, GFocher, FSmith, ERSpadari, SGambino, JWright, GE Synthesis, properties, and pharmacokinetic studies of N2-phenylguanine derivatives as inhibitors of herpes simplex virus thymidine kinases. J Med Chem 38:49-57 (1995)  
Target
Name:
Thymidine kinase, cytosolic
Synonyms:
KITH_HUMAN | TK1
Type:
PROTEIN
Mol. Mass.:
25476.50
Organism:
Homo sapiens (Human)
Description:
ChEMBL_1333884
Residue:
234
  
Inhibitor
Name:
BDBM21866
Synonyms:
2-phenylamino-9-(4-hydroxybutyl)-6-oxopurine CHEMBL406254 | HBPG
Type:
Small organic molecule
Emp. Form.:
C15H17N5O2
Mol. Mass.:
299.3278
SMILES:
OCCCCn1cnc2c1nc(Nc1ccccc1)[nH]c2=O
: