Target
Adenosine receptor A2a
Ligand
BDBM50202986
Substrate
Meas. Tech.
ChEMBL_959624 (CHEMBL2382694)
Ki
0.660000±n/a nM
Citation
 Stössel, ASchlenk, MHinz, SKüppers, PHeer, JGütschow, MMüller, CE Dual targeting of adenosine A(2A) receptors and monoamine oxidase B by 4H-3,1-benzothiazin-4-ones. J Med Chem 56:4580-96 (2013)  
Target
Name:
Adenosine receptor A2a
Synonyms:
AA2AR_RAT Adenosine A2 receptor Adenosine Receptors A2a (A2a) Adenosine receptors A2a Rat striatal adenosine A2a receptor
Type:
G Protein-Coupled Receptor (GPCR)
Mol. Mass.:
45015.65
Organism:
Rattus norvegicus (rat)
Description:
Rat A2A receptors expressed in CHO cells.
Residue:
410
  
Inhibitor
Name:
BDBM50202986
Synonyms:
2-furan-2-yl-7-(2-{4-[4-(2-methoxy-ethoxy)-phenyl]-piperazin-1-yl}-ethyl)-2,7-dihydro-3H-pyrazolo[4,3-e][1,2,4]triazolo[1,5-c]pyrimidin-5-ylamine 7-(2-(4-(2,4-difluorophenyl)piperazin-1-yl)ethyl)-2-(furan-2-yl)-7H-pyrazolo[4,3-e][1,2,4]triazolo[1,5-c]pyrimidin-5-amine SCH-420814 US11472811, Example Preladenant | preladenant
Type:
Small organic molecule
Emp. Form.:
C25H29N9O3
Mol. Mass.:
503.5563
SMILES:
COCCOc1ccc(cc1)N1CCN(CCn2ncc3c2nc(N)n2nc(nc32)-c2ccco2)CC1
: