Target
Epidermal growth factor receptor
Ligand
BDBM5447
Substrate
Meas. Tech.
ChEMBL_958682 (CHEMBL2383984)
IC50
0.100000±n/a nM
Citation
 Han, CHuang, ZZheng, CWan, LZhang, LPeng, SDing, KJi, HTian, JZhang, Y Novel hybrids of (phenylsulfonyl)furoxan and anilinopyrimidine as potent and selective epidermal growth factor receptor inhibitors for intervention of non-small-cell lung cancer. J Med Chem 56:4738-48 (2013)  
Target
Name:
Epidermal growth factor receptor
Synonyms:
EGF Receptor Substrate EGFR_HUMAN ERBB1 Epidermal Growth Factor Receptor erbB-1 Epidermal growth factor receptor (EGFR) HER1 Proto-oncogene c-ErbB-1 Tyrosine-Protein Kinase ErbB-1
Type:
Receptor Kinase Domain
Mol. Mass.:
134279.59
Organism:
Homo sapiens (Human)
Description:
P00533
Residue:
1210
  
Inhibitor
Name:
BDBM5447
Synonyms:
CHEMBL939 Iressa N-(3-chloro-4-fluorophenyl)-7-methoxy-6-[3-(morpholin-4-yl)propoxy]quinazolin-4-amine US10507209, Compound Gefitinib US9730934, Gefitinib WO2022090481, Example gefitinib cid_123631
Type:
Small organic molecule
Emp. Form.:
C22H24ClFN4O3
Mol. Mass.:
446.902
SMILES:
COc1cc2ncnc(Nc3ccc(F)c(Cl)c3)c2cc1OCCCN1CCOCC1
: