Target
ATP-citrate synthase
Ligand
BDBM50036214
Substrate
Meas. Tech.
ChEMBL_29524 (CHEMBL640440)
Ki
29000±n/a nM
Citation
 Dolle, REGribble, AWilkes, TKruse, LIEggleston, DSaxty, BAWells, TNGroot, PH Synthesis of novel thiol-containing citric acid analogues. Kinetic evaluation of these and other potential active-site-directed and mechanism-based inhibitors of ATP citrate lyase. J Med Chem 38:537-43 (1995)  
Target
Name:
ATP-citrate synthase
Synonyms:
ACLY_RAT | Acly
Type:
PROTEIN
Mol. Mass.:
120645.65
Organism:
Rattus norvegicus
Description:
ChEMBL_857791
Residue:
1100
  
Inhibitor
Name:
BDBM50036214
Synonyms:
(2R,3R)-3-Carboxy-2-chloro-3-hydroxy-pentanedioic acid | CHEMBL346376
Type:
Small organic molecule
Emp. Form.:
C6H7ClO7
Mol. Mass.:
226.569
SMILES:
OC(=O)C[C@](O)([C@@H](Cl)C(O)=O)C(O)=O
: