Target
5-hydroxytryptamine receptor 1A
Ligand
BDBM50016013
Substrate
Meas. Tech.
ChEMBL_807 (CHEMBL615786)
EC50
5200±n/a nM
Citation
 Hedberg, MHJohansson, AMNordvall, GYliniemelä, ALi, HBMartin, ARHjorth, SUnelius, LSundell, SHacksell, U (R)-11-hydroxy- and (R)-11-hydroxy-10-methylaporphine: synthesis, pharmacology, and modeling of D2A and 5-HT1A receptor interactions. J Med Chem 38:647-58 (1995)  
Target
Name:
5-hydroxytryptamine receptor 1A
Synonyms:
5-HT-1A 5-HT1A 5-hydroxytryptamine receptor 1A (5HT1A) 5ht1a Htr1a Serotonin 1a (5-HT1a) receptor/Adrenergic receptor alpha-1 | Serotonin receptor 1A
Type:
G Protein-Coupled Receptor (GPCR)
Mol. Mass.:
46445.29
Organism:
Rattus norvegicus (rat)
Description:
Binding assays were performed using rat hippocampal membranes.
Residue:
422
  
Inhibitor
Name:
BDBM50016013
Synonyms:
(R)-6-methyl-5,6,6a,7-tetrahydro-4H-dibenzo[de,g]quinolin-11-ol CHEMBL119455 | R-(-)-11-hydroxy-aporphine
Type:
Small organic molecule
Emp. Form.:
C17H17NO
Mol. Mass.:
251.323
SMILES:
CN1CCc2cccc-3c2[C@H]1Cc1cccc(O)c-31
: