Target
Endothelin-1 receptor
Ligand
BDBM50034433
Substrate
Meas. Tech.
ChEMBL_63361 (CHEMBL676097)
IC50
260±n/a nM
Citation
 Krystek, SRHunt, JTStein, PDStouch, TR Three-dimensional quantitative structure-activity relationships of sulfonamide endothelin inhibitors. J Med Chem 38:659-68 (1995)  
Target
Name:
Endothelin-1 receptor
Synonyms:
EDNRA_RAT Ednra Endothelin-1 receptor
Type:
Enzyme Catalytic Domain
Mol. Mass.:
48256.91
Organism:
RAT
Description:
ENDOTHELIN A EDNRA RAT::P26684
Residue:
426
  
Inhibitor
Name:
BDBM50034433
Synonyms:
4-Amino-N-(4,5-dimethyl-isoxazol-3-yl)-benzenesulfonamide Sulfatroxazole
Type:
Small organic molecule
Emp. Form.:
C11H13N3O3S
Mol. Mass.:
267.304
SMILES:
Cc1onc(NS(=O)(=O)c2ccc(N)cc2)c1C
: