Target
D(2) dopamine receptor
Ligand
BDBM50036647
Substrate
Meas. Tech.
ChEBML_62887
Ki
1.70±n/a nM
Citation
 Mewshaw, REAbreu, MESilverman, LSMathew, RMTiffany, CWBailey, MAKarbon, EWFerkany, JWKaiser, C Examination of the D2/5-HT2 affinity ratios of resolved 5,6,7,8,9,10-hexahydro-7,10-iminocyclohept[b]indoles: an enantioselective approach toward the design of potential atypical antipsychotics. J Med Chem 36:3073-6 (1993)  
Target
Name:
D(2) dopamine receptor
Synonyms:
DOPAMINE D2 DOPAMINE D2 Short Dopamine D2 receptor Drd2
Type:
G Protein-Coupled Receptor (GPCR)
Mol. Mass.:
50931.60
Organism:
Rattus norvegicus (rat)
Description:
P61169
Residue:
444
  
Inhibitor
Name:
BDBM50036647
Synonyms:
(7R,10S)-5-[9,15-diazatetracyclo[10.2.1.02,10.03,8]pentadeca-2(10),3,5,7-tetraen-15-yl]-1-(4-fluorophenyl)-1-pentanone 5-[9,15-diazatetracyclo[10.2.1.02,10.03,8]pentadeca-2(10),3,5,7-tetraen-15-yl]-1-(4-fluorophenyl)-1-pentanone | CHEMBL285712
Type:
Small organic molecule
Emp. Form.:
C24H25FN2O
Mol. Mass.:
376.4665
SMILES:
Fc1ccc(cc1)C(=O)CCCCN1C2CCC1c1c(C2)[nH]c2ccccc12
: