Target
D(2) dopamine receptor
Ligand
BDBM50036651
Substrate
Meas. Tech.
ChEMBL_62887 (CHEMBL673597)
Ki
308±n/a nM
Citation
 Mewshaw, REAbreu, MESilverman, LSMathew, RMTiffany, CWBailey, MAKarbon, EWFerkany, JWKaiser, C Examination of the D2/5-HT2 affinity ratios of resolved 5,6,7,8,9,10-hexahydro-7,10-iminocyclohept[b]indoles: an enantioselective approach toward the design of potential atypical antipsychotics. J Med Chem 36:3073-6 (1993)  
Target
Name:
D(2) dopamine receptor
Synonyms:
DOPAMINE D2 DOPAMINE D2 Short Dopamine D2 receptor Drd2
Type:
G Protein-Coupled Receptor (GPCR)
Mol. Mass.:
50931.60
Organism:
Rattus norvegicus (rat)
Description:
P61169
Residue:
444
  
Inhibitor
Name:
BDBM50036651
Synonyms:
(7R,10S)-1-(6-fluorobenzo[d]isoxazol-3-yl)-3-[5-fluoro-9,15-diazatetracyclo[10.2.1.02,10.03,8]pentadeca-2(10),3,5,7-tetraen-15-yl]propane 1-(6-fluorobenzo[d]isoxazol-3-yl)-3-[5-fluoro-9,15-diazatetracyclo[10.2.1.02,10.03,8]pentadeca-2(10),3,5,7-tetraen-15-yl]propane | CHEMBL284172
Type:
Small organic molecule
Emp. Form.:
C23H21F2N3O
Mol. Mass.:
393.4291
SMILES:
Fc1ccc2c(CCCN3C4CCC3c3c(C4)[nH]c4ccc(F)cc34)noc2c1
: