Target
Kappa-type opioid receptor
Ligand
BDBM50491882
Substrate
Meas. Tech.
ChEMBL_961551 (CHEMBL2388582)
Ki
0.037000±n/a nM
Citation
 Watanabe, YKitazawa, SNemoto, THirayama, SIwai, TFujii, HNagase, H Design and synthesis of novel opioid ligands with an azabicyclo[2.2.2]octane skeleton having a 7-amide side chain and their pharmacologies. Bioorg Med Chem 21:3032-50 (2013)  
Target
Name:
Kappa-type opioid receptor
Synonyms:
Kappa Opioid Receptor OPRK1 Opiate Kappa 1 | mu/kappa opioid receptor
Type:
G Protein-Coupled Receptor (GPCR)
Mol. Mass.:
42744.99
Organism:
Cavia porcellus (domestic guinea pig)
Description:
P41144
Residue:
380
  
Inhibitor
Name:
BDBM50491882
Synonyms:
CHEMBL3215908
Type:
Small organic molecule
Emp. Form.:
C30H37Cl2N3O4
Mol. Mass.:
574.538
SMILES:
Cl.Cl.[H][C@@]12Oc3c4c(C[C@@]5([H])N(CC6CC6)CC[C@]14[C@@]51CC[C@@]2(O)[C@H](CC(=O)NCc2ccccc2)N1)ccc3O
: