Target
Mu-type opioid receptor
Ligand
BDBM50491882
Substrate
Meas. Tech.
ChEMBL_961553 (CHEMBL2388584)
Ki
0.052000±n/a nM
Citation
 Watanabe, YKitazawa, SNemoto, THirayama, SIwai, TFujii, HNagase, H Design and synthesis of novel opioid ligands with an azabicyclo[2.2.2]octane skeleton having a 7-amide side chain and their pharmacologies. Bioorg Med Chem 21:3032-50 (2013)  
Target
Name:
Mu-type opioid receptor
Synonyms:
M-OR-1 Mor OPRM_MOUSE Oprm | Oprm1
Type:
Enzyme Catalytic Domain
Mol. Mass.:
44431.62
Organism:
MOUSE
Description:
OPIATE Mu OPRM1 MOUSE::P42866
Residue:
398
  
Inhibitor
Name:
BDBM50491882
Synonyms:
CHEMBL3215908
Type:
Small organic molecule
Emp. Form.:
C30H37Cl2N3O4
Mol. Mass.:
574.538
SMILES:
Cl.Cl.[H][C@@]12Oc3c4c(C[C@@]5([H])N(CC6CC6)CC[C@]14[C@@]51CC[C@@]2(O)[C@H](CC(=O)NCc2ccccc2)N1)ccc3O
: