Target
Mu-type opioid receptor
Ligand
BDBM50453625
Substrate
Meas. Tech.
ChEMBL_138885 (CHEMBL747877)
IC50
0.200000±n/a nM
Citation
 Pitzele, BSHamilton, RWKudla, KDTsymbalov, SStapelfeld, ASavage, MAClare, MHammond, DLHansen, DW Enkephalin analogs as systemically active antinociceptive agents: O- and N-alkylated derivatives of the dipeptide amide L-2,6-dimethyltyrosyl-N-(3-phenylpropyl)-D-alaninamide. J Med Chem 37:888-96 (1994)  
Target
Name:
Mu-type opioid receptor
Synonyms:
MOR-1 Mu-type opioid receptor (MOR) OPRM_RAT Opioid receptor B Ror-b
Type:
G Protein-Coupled Receptor (GPCR)
Mol. Mass.:
44503.11
Organism:
Rattus norvegicus (rat)
Description:
Competition binding assays were carried out using membrane preparations from transfected HN9.10 cells that constitutively expressed the mu opioid receptor.
Residue:
398
  
Inhibitor
Name:
BDBM50453625
Synonyms:
CHEMBL2110229
Type:
Small organic molecule
Emp. Form.:
C24H33N3O3
Mol. Mass.:
411.5371
SMILES:
C[C@@H](N(C)C(=O)[C@@H](N)Cc1c(C)cc(O)cc1C)C(=O)NCCCc1ccccc1
: