Target
Replicase polyprotein 1ab
Ligand
BDBM50276756
Substrate
Meas. Tech.
ChEMBL_964809 (CHEMBL2395055)
Ki
10600±n/a nM
Citation
 Park, JYKim, JHKwon, JMKwon, HJJeong, HJKim, YMKim, DLee, WSRyu, YB Dieckol, a SARS-CoV 3CL(pro) inhibitor, isolated from the edible brown algae Ecklonia cava. Bioorg Med Chem 21:3730-7 (2013)  
Target
Name:
Replicase polyprotein 1ab
Synonyms:
3C-like proteinase 3C-like proteinase (SARS-CoV 3Cpro) 3CLp GFL Guanine-N7 methyltransferase Helicase Leader protein Non-structural protein 10 Non-structural protein 3 Non-structural protein 6 Non-structural protein 8 ORF1ab polyprotein PL2-PRO Pol R1AB_SARS RdRp SARS coronavirus main proteinase nsp1 nsp12 nsp14 nsp16 nsp3 nsp5 nsp7 nsp9 pp1ab | rep
Type:
Protein
Mol. Mass.:
790250.81
Organism:
Human SARS coronavirus (SARS-CoV) (Severe acute respiratory syndrome coronavirus)
Description:
P0C6X7
Residue:
7073
  
Inhibitor
Name:
BDBM50276756
Synonyms:
4,9-bis(3,5-dihydroxyphenoxy)benzofuro[3,2-a]dibenzo[b,e][1,4]dioxine-1,3,6,10,12-pentaol Phlorofucofuroeckol-A phlorofucofuroeckol A
Type:
Small organic molecule
Emp. Form.:
C30H18O14
Mol. Mass.:
602.4555
SMILES:
Oc1cc(O)cc(Oc2c(O)cc(O)c3Oc4c(Oc23)c(O)cc2oc3c(Oc5cc(O)cc(O)c5)c(O)cc(O)c3c42)c1
: