Target
Beta-2 adrenergic receptor
Ligand
BDBM50036835
Substrate
Meas. Tech.
ChEMBL_37823 (CHEMBL653455)
Ki
140±n/a nM
Citation
 Macchia, BBalsamo, ABreschi, MCChiellini, GMacchia, MMartinelli, AMartini, CNardini, CNencetti, SRossello, A The [(methyloxy)imino]methyl moiety as a bioisoster of aryl. A novel class of completely aliphatic beta-adrenergic receptor antagonists. J Med Chem 37:1518-25 (1994)  
Target
Name:
Beta-2 adrenergic receptor
Synonyms:
ADRB2 Beta-2 adrenergic receptor Beta-2 adrenoreceptor | adrenergic Beta
Type:
Enzyme Catalytic Domain
Mol. Mass.:
47141.18
Organism:
BOVINE
Description:
adrenergic Beta ADRB2 BOVINE::Q28044
Residue:
418
  
Inhibitor
Name:
BDBM50036835
Synonyms:
1-(3,4-Dichloro-phenyl)-2-isopropylamino-ethanol CHEMBL30816 | Dichloroisoproterenol,(+/-)
Type:
Small organic molecule
Emp. Form.:
C11H15Cl2NO
Mol. Mass.:
248.149
SMILES:
CC(C)NCC(O)c1ccc(Cl)c(Cl)c1
: