Target
Beta-2 adrenergic receptor
Ligand
BDBM50036836
Substrate
Meas. Tech.
ChEMBL_37823 (CHEMBL653455)
Ki
4580±n/a nM
Citation
 Macchia, BBalsamo, ABreschi, MCChiellini, GMacchia, MMartinelli, AMartini, CNardini, CNencetti, SRossello, A The [(methyloxy)imino]methyl moiety as a bioisoster of aryl. A novel class of completely aliphatic beta-adrenergic receptor antagonists. J Med Chem 37:1518-25 (1994)  
Target
Name:
Beta-2 adrenergic receptor
Synonyms:
ADRB2 Beta-2 adrenergic receptor Beta-2 adrenoreceptor | adrenergic Beta
Type:
Enzyme Catalytic Domain
Mol. Mass.:
47141.18
Organism:
BOVINE
Description:
adrenergic Beta ADRB2 BOVINE::Q28044
Residue:
418
  
Inhibitor
Name:
BDBM50036836
Synonyms:
CHEMBL38114 | Propionaldehyde O-(2-hydroxy-3-isopropylamino-propyl)-oxime; compound with (E)-but-2-enedioic acid
Type:
Small organic molecule
Emp. Form.:
C9H20N2O2
Mol. Mass.:
188.2673
SMILES:
CC\C=N\OCC(O)CNC(C)C
: